BDBM50368637 CHEMBL1744036
SMILES CCCN(CCC)[C@@H]1CCc2ccc3[nH]c(cc3c2C1)C(N)=O
InChI Key InChIKey=AJMVNIXLWRBDLU-CQSZACIVSA-N
Data  2 KI
  Tab Delimited (TSV)   2D SDfile   Computed 3D by Vconf -m prep SDfile
Find this compound or compounds like it in BindingDB:
Activity Spreadsheet -- Enzyme Inhibition Constant Data from BindingDB
Found 1 hit for monomerid = 50368637
Target5-hydroxytryptamine receptor 1A(Homo sapiens (Human))
Upjohn Laboratories
Curated by ChEMBL
LigandPNGBDBM50368637(CHEMBL1744036)
Affinity DataKi:  1.60nM. Assay description: Displacement of [3H]8-OH-DPAT from 5-hydroxytryptamine 1A receptor of bovine hippocampus.
In DepthDetails ArticlePubMed